National Credit Union Administration
type: Class
alternative label: 全国信用社管理局
subclass of: R22815eC3Af3bFF0d002Ca58
hidden label: NCUA
definition: The National Credit Union Administration (NCUA) is the independent federal agency created by the United States Congress to regulate, charter, and supervise federal credit unions.