Florida County Court - Holmes County
type: Class
subclass of: R71ioUDFC2H7Ndh54CU1rlM
definition: Florida County Court - Holmes County refers to the specific court located in Holmes County, Florida that has jurisdiction over certain legal matters within that county.