Labor Union
type: Class
preferred label: Trade Union
alternative label: 工会
subclass of: R7oBWHStfmqTLn2MypkW3Pj
hidden label: TRADUN
definition: A trade union (or a labor union in the U.S.) is an association of workers forming a legal unit or legal personhood, usually called a "bargaining unit", which acts as bargaining agent and legal representative for a unit of employees in all matters of law or right arising from or in the administration of a collective agreement.