Indiana Superior Court - Posey County
type: Class
subclass of: R7uq2Mq8qLUybQoDhVczzZ5
definition: A court of general jurisdiction in Indiana that has the authority to hear and decide civil and criminal cases within Posey County.