Unit per Stage
type: Class
alternative label: 单位每阶段
subclass of: Ro1RKRYnlciGrhgC4NjuDV
definition: A "Unit per Stage" is a type of unit used to measure fees or expenses in a legal engagement, where the fee or expense is charged based on completion of a specific stage or milestone.