Motion for Appointment of Ombudsman
type: Class
alternative label: 任命调解员动议
subclass of: R9Ii4OzSADsjS0VegX12oQJ
definition: A Motion for Appointment of Ombudsman is a request made in a bankruptcy case for the appointment of an independent third party to investigate and resolve disputes between the debtor and creditors.