Motion in Limine to Exclude Report
type: Class
alternative label: 排除报告的限制性动议
subclass of: RBGmw0JXsA0c36ZVr7qvYeT
definition: A Motion in Limine to Exclude Report is a legal request to prevent a specific report from being presented as evidence in a trial or hearing.