Defense Criminal Investigative Service
type: Class
alternative label: 国防刑事调查局
subclass of: R0939f8242e27A3119dC5909
hidden label: DCIS
definition: The Defense Criminal Investigative Service is the criminal investigative arm of the Office of the Inspector General, U.S. Department of Defense.