Management Agreement
type: Class
subclass of: RZ2ygZBRYA0HT25x0f50Du
definition: A Management Agreement is a contract in which one entity entrusts another with the management of its operations or properties. It outlines the responsibilities, performance expectations, compensation, and other terms for the managing entity.