Product Inherently Unsafe
type: Class
alternative label: 产品固有不安全
subclass of: RCc50c8MA7S8aeFuufxdksV
definition: A product that is inherently dangerous or hazardous, and therefore cannot be made safe even with reasonable care, which may be used as a defense in a product liability lawsuit.