Romanian; Moldavian; Moldovan
type: Class
alternative label: 罗马尼亚语; 摩尔多瓦语
subclass of: RDOvAHsvY8TKJ1O1orXPM9o
definition: A language spoken in Romania and Moldova, which is a member of the Romance language family.