Missouri Circuit Court - Lawrence County
type: Class
subclass of: RDECjssxw76vdlahxiUTb4L
definition: Missouri Circuit Court - Lawrence County: A court of law in Missouri that has jurisdiction over legal matters within Lawrence County.