Consumer Contract Containing Unlawful Provision
type: Class
alternative label: 包含非法条款的消费者合同
subclass of: R7n6xn6CbnvekygNrB5DsJM
definition: A Consumer Contract Containing Unlawful Provision is a type of claim related to contracts between consumers and businesses, where the contract includes a provision that is illegal or against public policy.