Chuvash
type: Class
alternative label: 楚瓦什语
subclass of: RDOvAHsvY8TKJ1O1orXPM9o
definition: Chuvash (Language) is a structured system of communication that consists of grammar and vocabulary specific to the Chuvash people and culture.