Podcast
type: Class
alternative label: Pod
subclass of: R9r2XYxmAiksCgeIwOht0sP
definition: A Podcast is a digital audio recording series, often structured as episodes, that can cover various topics such as interviews, storytelling, discussions, or educational content.