New Jersey Superior Court - Gloucester County
type: Class
subclass of: R1A5cd40F21ccBABafb0C2e8
definition: The New Jersey Superior Court - Gloucester County is a specific court within the New Jersey Superior Court Appellate Division that has jurisdiction over civil and criminal cases in Gloucester County, New Jersey.