Due Diligence Contingency Clause
type: Class
alternative label: 尽职调查附条件条款
subclass of: RqBMS8HFJwbfAcW0aEKhyF
definition: A due diligence contingency clause is a provision in a contract that allows a party to conduct an investigation or review of the subject matter before the contract becomes binding.