Services Warranty Clause
type: Class
alternative label: 服务保证条款
subclass of: R8hyVs9MsMpcl891lEFtGTg
definition: A Services Warranty Clause is a provision in a contract that guarantees the quality and performance of services provided by one party to another.