Motion to Determine Mortgage Fees and Expenses
type: Class
alternative label: 确定抵押费用和支出的动议
subclass of: R9Ii4OzSADsjS0VegX12oQJ
definition: A Motion to Determine Mortgage Fees and Expenses is a legal request made in a bankruptcy case to determine the amount of fees and expenses associated with a mortgage.