Novation
type: Class
alternative label: 转让
subclass of: R9UXMB7LO35e1n0zwV2MVmh
subclass of: RCzs34uEQI9f4cuWp3bQO0P
definition: The concept of Novation refers to the substitution of a new contract or obligation for an existing one, with the mutual agreement of all parties involved, resulting in the discharge of the original obligation.