Motion to Stay Proceedings Pending Covered Business Method Review
type: Class
alternative label: 暂停程序，等待覆盖商业方法审查
subclass of: R8r0fE60KG2VwRq1OwbjEUY
definition: A Motion to Stay Proceedings Pending Covered Business Method (CBM) Review is a request to pause legal proceedings while a review of a specific type of business method patent is conducted.