Future Injury from Present Tortious Personal Injury
type: Class
alternative label: 现行侵权人身伤害的未来伤害
subclass of: R8alUnZrt8GVEzHYhh1KTva
definition: Future Injury from Present Tortious Personal Injury: A claim for damages resulting from a personal injury that has not yet manifested, but is likely to occur in the future as a direct result of the initial injury.