Indiana City Court - Vigo County, Terre Haute City
type: Class
subclass of: RB2WeMKEJKLlp2qzlwh5Cay
definition: A court located in Vigo County, Terre Haute City, Indiana that has jurisdiction over cases within its geographical boundaries.