Ohio Court of Appeals - Montgomery County
type: Class
subclass of: RDA377a2FBba514F7b1975bb
definition: Ohio Court of Appeals - Montgomery County: A court of appeals located in Montgomery County, Ohio that hears appeals from lower courts within its jurisdiction.