Asset Valuation Practice
type: Class
alternative label: 资产估值实践
subclass of: R957mHhJSapbowW1nGWXSwT
definition: Asset Valuation Practice refers to the specialized area of Asset Analysis that involves determining the monetary value of a particular asset or group of assets.