Deposition Recording
type: Class
alternative label: 证言记录
subclass of: RCn0LN18AxXoXv6siHJN9XM
definition: A Deposition Recording is a type of transcript or recording that captures the testimony of a witness or party under oath, typically used in legal proceedings.