Kinyarwanda
type: Class
alternative label: 基尼亚鲁旺达语
subclass of: RDOvAHsvY8TKJ1O1orXPM9o
definition: Kinyarwanda is a structured system of communication consisting of grammar and vocabulary, used in legal matters, that is specifically spoken in Rwanda and neighboring countries.