Mandatory Arbitration Clause
type: Class
alternative label: 强制性仲裁条款
subclass of: RDe0RKU39BlhcyACJW30ZLc
definition: A mandatory arbitration clause is a provision in a contract that requires any disputes arising from the contract to be resolved through arbitration rather than through the court system.