Work Product Ownership Clause
type: Class
alternative label: 工作成果所有权条款
subclass of: RDe0RKU39BlhcyACJW30ZLc
definition: A Work Product Ownership Clause is a provision in a contract that specifies the ownership rights of the work product created under the contract.