Pennsylvania Magisterial District Court - Tioga County
type: Class
subclass of: R70IGZ5XRTshj1E64tVcxJD
definition: A Pennsylvania Magisterial District Court in Tioga County is a specific court within the Pennsylvania Magisterial District Court system that has jurisdiction over minor criminal offenses and civil cases.