140 Negotiable Instrument (PACER NoS)
type: Class
subclass of: RCNVgIoWmZL1X9aDWlGZuX9
definition: Action relating to an agreement to pay a specific amount of money, including promissory notes, loan agreements and checks.