Mechanical Patent
type: Class
preferred label: Mechanical Engineering patent
alternative label: Machine Patent
subclass of: R79ZnCKDSoLOn17LGjAF6G6
definition: A mechanical patent is a legal protection granted to inventors of new and useful machines, mechanical devices, or improvements thereof.