Marine Corps
type: Class
preferred label: Marines
subclass of: R9Dxh7cqKFFJ2jKNTvICMhf
definition: A Marine Corps is an amphibious warfare branch of a nation's armed forces, specializing in projecting military power from the sea onto hostile or potentially hostile shores. This force is trained to operate in maritime, littoral, and land environments, often serving as a rapid response force for expeditionary operations.