Theft Locations
type: Class
alternative label: 盗窃地点
subclass of: RBpSXv8uOXDikW5jk944sRN
definition: Theft Locations refer to specific places or settings where theft occurs, such as buildings, motor vehicles, or coin-operated machines, and are a subcategory of Criminal Theft.