Norwegian
type: Class
alternative label: 挪威语
subclass of: RDOvAHsvY8TKJ1O1orXPM9o
definition: Norwegian (Language) is a structured system of communication consisting of grammar and vocabulary used in Norway and other Norwegian-speaking regions.