Nauru
type: Class
alternative label: 瑙鲁
subclass of: RDOvAHsvY8TKJ1O1orXPM9o
definition: Nauru (Language) refers to the structured system of communication consisting of grammar and vocabulary used in the Pacific island nation of Nauru.