Wrongful Incarceration
type: Class
alternative label: 错误的监禁
subclass of: RBREngQZS9QIgeWCOMPBLIo
definition: The concept of Wrongful Incarceration refers to the unlawful detention of an individual by the government, which results in the deprivation of their liberty and freedom.