Waste Management and Remediation Services Industry
type: Class
alternative label: 废物管理和修复服务行业
subclass of: RN2D91ENKaHvvID40zUJvt
hidden label: WAST
definition: Industries in this group are engaged in the collection, treatment, and disposal of waste materials. This includes establishments engaged in local hauling of waste materials; operating materials recovery facilities (i.e., those that sort recyclable materials from the trash stream); providing remediation services (i.e., those that provide for the cleanup of contaminated buildings, mine sites, soil, or ground water); and providing septic pumping and other miscellaneous waste management services. There are three industry groups within the subsector that separate these activities into waste collection, waste treatment and disposal, and remediation and other waste management.