Motion to Reopen Chapter 7 Case
type: Class
alternative label: 重新开启第7章案件的动议
subclass of: RBzzDROF8jrIsTSANJGlahX
definition: A Motion to Reopen Chapter 7 Case is a request made to the court to reopen a previously closed bankruptcy case under Chapter 7 of the Bankruptcy Code.