Magahi
type: Class
alternative label: 马加希语
subclass of: RDOvAHsvY8TKJ1O1orXPM9o
definition: Magahi is a language that belongs to the Indo-Aryan language family and is primarily spoken in the Bihar state of India.