Gifts Causa Mortis
type: Class
alternative label: 死亡原因礼物
subclass of: R3SDQBy4KfjSgp3bgpb4Fx
definition: A gift causa mortis is a transfer of property made by a person who is anticipating their imminent death, and is made with the expectation that the gift will only take effect if the donor dies from the illness or peril that they are facing.