Mohawk
type: Class
alternative label: 莫霍克
subclass of: RC1ceWXE3emNHpYlrOvvmxG
subclass of: RDOvAHsvY8TKJ1O1orXPM9o
definition: A Native American language spoken by the Mohawk people, characterized by its complex grammar and unique phonetics.