Food Services and Drinking Places Industry
type: Class
alternative label: 餐饮服务和饮料行业
subclass of: RDeR0053Q1cPSk9hSjORcBT
hidden label: FSDP
definition: Industries in this froup prepare meals, snacks, and beverages to customer order for immediate on-premises and off-premises consumption. There is a wide range of establishments in these industries. Some provide food and drink only; while others provide various combinations of seating space, waiter/waitress services and incidental amenities, such as limited entertainment. The group includes special food services, such as food service contractors, caterers, and mobile food services; drinking places; and restaurants and other eating places.