Invalidity Analysis Practice
type: Class
alternative label: 无效性分析实践
subclass of: RVZJBUCRB7cgWN1CIbeJJq
definition: Invalidity Analysis Practice is a legal service that involves investigating and developing facts related to the invalidity of a legal matter.