tax_authority_ref
type: Class
subclass of: RHfeijrOTjaF7qpuoGIGkR
definition: In some countries tax invoices must be routed, approved and in some cases even delivered to the customers by a platform controlled and/or imposed by the tax authority. This platform normally returns an approval code/identifier to the invoice issuer for audit trail purposes. Such code/identifier may need to be communicated to the customer as a reference depending on the jurisdiction. Use this field to specify the approval code/identifier if required in your country.