Aymara
type: Class
alternative label: 艾马拉语
subclass of: RDOvAHsvY8TKJ1O1orXPM9o
definition: Aymara is a language that belongs to the Language top-level class and is spoken in the Andes region of South America, particularly in Bolivia, Peru, and Chile.