European Parliament
type: Class
preferred label: EU Parliament
alternative label: Parliament of the European Union
subclass of: RVG1zLys64KOCQFR2MhzS7
definition: The European Parliament is one of the legislative bodies of the European Union, composed of members elected by citizens of the member states. It shares the power to legislate, supervise, and budget with the Council of the European Union, representing the interests of EU citizens.