L430 Written Motions and Submissions
type: Class
subclass of: RDkc9fh6vYvZbJc7ERuIJCf
definition: A written request or argument submitted to a court or other legal authority during the trial preparation and trial phases of a legal case.