New York County Court
type: Class
subclass of: R3391bdB1A2adE51071C7cf7
definition: New York County Court is a court of general jurisdiction located in New York County, New York, which hears both civil and criminal cases.