Indemnification of Employee Clause
type: Class
alternative label: 员工赔偿条款
subclass of: R9oz08cWJcI23x0nYU1h0it
definition: A provision in a contract that requires one party to compensate and protect an employee of the other party from any legal claims or losses arising from their work or actions.